{"text_format":"1","workbook":"xlsx","n_sheets":5,"sheets":["Laskupohja vaaka","Esimerkki","Laskupohja pysty","Tuoteluettelo","Ohje"],"not_rendered":{"charts":0,"images":5,"macros":1,"external_links":0,"defined_names":9,"comments":3,"pivot_tables":0},"unopened":[],"bounds":{"document_bytes":16777216,"sheet_cells":100000,"rows_first":2000,"rows_last":500,"rows_between":2000,"halvings":0,"cell_chars":16384,"cell_head_chars":4096},"cells_cut":0,"cells_raw":0,"read":"whole","date_system":"1900"}

{"sheet":"Laskupohja vaaka","index":0,"n_rows":31,"n_cols":32,"rows_kept":31,"cut":false,"hidden":false,"merged":[[2,3,2,9],[5,4,5,9],[6,4,6,9],[22,4,22,8],[23,4,23,8],[7,3,7,9],[8,3,8,9],[9,4,9,9],[30,3,30,10],[3,3,3,9],[8,13,8,14],[20,4,20,8],[21,4,21,8],[13,4,13,8],[14,4,14,8],[15,4,15,8],[16,4,16,8],[17,4,17,8],[18,4,18,8],[19,4,19,8],[4,4,4,9],[24,4,24,8],[25,4,25,8],[5,13,5,14],[2,10,2,12],[3,10,3,12],[4,10,4,12],[4,13,4,14],[2,13,2,14],[3,13,3,14],[5,10,5,12],[8,10,8,12],[9,10,9,12],[9,13,9,14],[7,13,7,14],[7,11,7,12],[6,11,6,12],[10,13,10,14],[28,4,28,5],[28,6,28,10],[27,3,27,9],[26,11,26,13],[27,11,27,13],[28,11,28,13],[11,10,11,12],[11,3,11,9],[10,10,10,12],[10,3,10,9]]}
[null,null,null,"Myyjä",null,null,null,null,null,null,"LASKU "]
[]
[null,null,null,"NIMI",null,null,null,null,null,null,"Päivämäärä",null,null,"Laskun numero"]
[null,null,null,"KATUOSOITE",null,null,null,null,null,null,"00.00.0000",null,null,0]
[null,null,null,"POSTINRO ","POSTITOIMIPAIKKA",null,null,null,null,null,"Viitenumero",null,null,"Asiakasnumero"]
[null,null,null,"PUHELINNUMERO","SÄHKÖPOSTI",null,null,null,null,null,"00000 00000 00000",null,null,0]
[null,null,null,"Y-tunnus",null,null,null,null,null,null,"Viivästyskorko",0,null,"Huomautusaika"]
[null,null,null,"Ostaja",null,null,null,null,null,null,"Maksuehdot","vrk",null,"Eräpäivä"]
[null,null,null,"KATUOSOITE",null,null,null,null,null,null,"Toimituspäivä",null,null,"00.00.0000"]
[null,null,null,"POSTINRO","POSTITOIMIPAIKKA",null,null,null,null,null,"00.00.0000",null,null,"Tilausnumero"]
[null,null,null,"SÄHKÖPOSTI",null,null,null,null,null,null,"Maksun saajan tilinumero",null,null,0]
[null,null,null,"Y-tunnus"]
[]
[null,null,null,"Tuotenumero","Tuotenimi",null,null,null,null,"määrä","á-hinta","Alv %","Veroton","Vero","Yhteensä"]
[null,null,null,{"$f":"IFERROR(VLOOKUP(E15,Tuoteluettelo!1:1048576,2,FALSE),\"\")","v":""},null,null,null,null,null,null,{"$f":"IFERROR(VLOOKUP(E15,Tuoteluettelo!1:1048576,3,FALSE),\"\")","v":""},0,{"$f":"IFERROR(J15*K15,\"0\")","v":"0"},{"$f":"IFERROR(L15*M15, \"0\")","v":0},{"$f":"IFERROR(M15+N15,\"0\")","v":0}]
[null,null,null,{"$f":"IFERROR(VLOOKUP(E16,Tuoteluettelo!1:1048576,2,FALSE),\"\")","v":""},null,null,null,null,null,null,{"$f":"IFERROR(VLOOKUP(E16,Tuoteluettelo!1:1048576,3,FALSE),\"\")","v":""},0,{"$f":"IFERROR(J16*K16,\"0\")","v":"0"},{"$f":"IFERROR(L16*M16, \"0\")","v":0},{"$f":"IFERROR(M16+N16,\"0\")","v":0}]
[null,null,null,{"$f":"IFERROR(VLOOKUP(E17,Tuoteluettelo!1:1048576,2,FALSE),\"\")","v":""},null,null,null,null,null,null,{"$f":"IFERROR(VLOOKUP(E17,Tuoteluettelo!1:1048576,3,FALSE),\"\")","v":""},0,{"$f":"IFERROR(J17*K17,\"0\")","v":"0"},0,0,null,null,null,null,null,null,null,null,null,null,null,null,null,null,null,null,"."]
[null,null,null,{"$f":"IFERROR(VLOOKUP(E18,Tuoteluettelo!1:1048576,2,FALSE),\"\")","v":""},null,null,null,null,null,null,{"$f":"IFERROR(VLOOKUP(E18,Tuoteluettelo!1:1048576,3,FALSE),\"\")","v":""},0,"0",0,0]
[null,null,null,{"$f":"IFERROR(VLOOKUP(E19,Tuoteluettelo!1:1048576,2,FALSE),\"\")","v":""},null,null,null,null,null,null,{"$f":"IFERROR(VLOOKUP(E19,Tuoteluettelo!1:1048576,3,FALSE),\"\")","v":""},0,"0",0,0]
[null,null,null,{"$f":"IFERROR(VLOOKUP(E20,Tuoteluettelo!1:1048576,2,FALSE),\"\")","v":""},null,null,null,null,null,null,{"$f":"IFERROR(VLOOKUP(E20,Tuoteluettelo!1:1048576,3,FALSE),\"\")","v":""},0,"0",0,0]
[null,null,null,{"$f":"IFERROR(VLOOKUP(E21,Tuoteluettelo!1:1048576,2,FALSE),\"\")","v":""},null,null,null,null,null,null,{"$f":"IFERROR(VLOOKUP(E21,Tuoteluettelo!1:1048576,3,FALSE),\"\")","v":""},0,"0",0,0]
[null,null,null,{"$f":"IFERROR(VLOOKUP(E22,Tuoteluettelo!1:1048576,2,FALSE),\"\")","v":""},null,null,null,null,null,null,{"$f":"IFERROR(VLOOKUP(E22,Tuoteluettelo!1:1048576,3,FALSE),\"\")","v":""},0,"0",0,0]
[null,null,null,{"$f":"IFERROR(VLOOKUP(E23,Tuoteluettelo!1:1048576,2,FALSE),\"\")","v":""},null,null,null,null,null,null,{"$f":"IFERROR(VLOOKUP(E23,Tuoteluettelo!1:1048576,3,FALSE),\"\")","v":""},0,"0",0,0]
[null,null,null,{"$f":"IFERROR(VLOOKUP(E24,Tuoteluettelo!1:1048576,2,FALSE),\"\")","v":""},null,null,null,null,null,null,{"$f":"IFERROR(VLOOKUP(E24,Tuoteluettelo!1:1048576,3,FALSE),\"\")","v":""},0,"0",0,0]
[null,null,null,{"$f":"IFERROR(VLOOKUP(E25,Tuoteluettelo!1:1048576,2,FALSE),\"\")","v":""},null,null,null,null,null,null,{"$f":"IFERROR(VLOOKUP(E25,Tuoteluettelo!1:1048576,3,FALSE),\"\")","v":""},0,"0",0,0]
[null,null,null,{"$f":"IFERROR(VLOOKUP(E26,Tuoteluettelo!1:1048576,2,FALSE),\"\")","v":""},null,null,null,null,null,null,{"$f":"IFERROR(VLOOKUP(E26,Tuoteluettelo!1:1048576,3,FALSE),\"\")","v":""},0,"0",0,0]
[null,null,null,null,null,null,null,null,null,null,null,"Veroton",null,null,{"$f":"M15+M16+M17+M18+M19+M20+M21+M22+M23+M24+M25+M26","v":0}]
[null,null,null,"Jos sinulla on tätä laskua koskevia kysymyksiä ota yhteyttä:",null,null,null,null,null,null,null,"Vero",null,null,{"$f":"N15+N16+N17+N18+N19+N20+N21+N22+N23+N24+N25+N26","v":0}]
[null,null,null,"Nimi","Puhelinnumero",null,"Sähköpostiosoite",null,null,null,null,"Maksettava yhteensä",null,null,{"$f":"O15+O16+O17+O18+O19+O20+O21+O22+O23+O24+O25+O26","v":0}]
[]
[null,null,null,"Kiitos palveluidemme käyttämisestä."]

{"sheet":"Esimerkki","index":1,"n_rows":32,"n_cols":13,"rows_kept":32,"cut":false,"hidden":false,"merged":[[0,1,0,7],[7,1,7,7],[7,9,7,10],[8,1,8,7],[8,8,8,10],[4,2,4,7],[5,2,5,7],[4,8,4,10],[5,8,5,10],[18,2,18,6],[9,2,9,7],[9,8,9,10],[11,1,11,7],[11,8,11,10],[12,8,12,12],[13,2,13,6],[14,2,14,6],[15,2,15,6],[16,2,16,6],[17,2,17,6],[9,11,9,12],[10,11,10,12],[20,2,20,6],[21,2,21,6],[22,2,22,6],[23,2,23,6],[24,2,24,6],[31,1,31,12],[1,1,1,7],[2,1,2,7],[3,2,3,7],[6,1,6,7],[6,11,6,12],[7,11,7,12],[8,11,8,12],[25,2,25,6],[26,9,26,11],[27,9,27,11],[28,9,28,11],[29,2,29,3],[29,4,29,8],[27,1,27,6],[19,2,19,6],[1,11,1,12],[10,8,10,10],[6,9,6,10],[4,11,4,12],[5,11,5,12],[2,8,2,10],[2,11,2,12],[3,8,3,10],[3,11,3,12]]}
[null,"Myyjä",null,null,null,null,null,null,"LASKU "]
[null,"Anssin Auto & Asennus",null,null,null,null,null,null,null,null,null,"Laskun numero"]
[null,"Kaarakuja 12",null,null,null,null,null,null,"Päivämäärä",null,null,1234]
[null,12300,"KOLARI",null,null,null,null,null,"2018-03-12",null,null,"Asiakasnumero"]
[null,1234567890,"anssinauto@yritys.com",null,null,null,null,null,"Viitenumero",null,null,123456]
[null,"Y-tunnus","12345-6",null,null,null,null,null,123456789101,null,null,"Huomautusaika"]
[null,"Ostaja",null,null,null,null,null,null,"Viivästyskorko",7.0000000000000007E-2,null,"7 vrk"]
[null,"Mirkku Mainio",null,null,null,null,null,null,"Maksuehdot","14 vrk",null,"Eräpäivä"]
[null,"Ketunpolku 3",null,null,null,null,null,null,"Toimituspäivä",null,null,"2018-03-26"]
[null,12400,"KÄPÄLÄMÄKI",null,null,null,null,null,"2018-02-12",null,null,"Tilausnumero"]
[null,"mirkku.mainio@yksityinen.fi",null,null,null,null,null,null,"Maksun saajan tilinumero",null,null,1234567]
[null,"y-tunnus",null,null,null,null,null,null,"FI12 1234 1234 123"]
[]
[null,"Tuotenumero","Tuotenimi",null,null,null,null,"määrä","á-hinta","Alv %","Veroton","Vero","Yhteensä"]
[null,{"$f":"IFERROR(VLOOKUP(C15,Tuoteluettelo!1:1048576,2,FALSE),\"\")","v":""},null,null,null,null,null,null,{"$f":"IFERROR(VLOOKUP(C15,Tuoteluettelo!1:1048576,3,FALSE),\"\")","v":""},0,{"$f":"IFERROR(H15*I15,\"0\")","v":"0"},{"$f":"IFERROR(J15*K15, \"0\")","v":0},{"$f":"IFERROR(K15+L15,\"0\")","v":0}]
[null,null,null,null,null,null,null,null,{"$f":"IFERROR(VLOOKUP(C16,Tuoteluettelo!1:1048576,3,FALSE),\"\")","v":""},0,{"$f":"IFERROR(H16*I16,\"0\")","v":"0"},{"$f":"IFERROR(J16*K16, \"0\")","v":0},{"$f":"IFERROR(K16+L16,\"0\")","v":0}]
[null,{"$f":"IFERROR(VLOOKUP(C17,Tuoteluettelo!1:1048576,2,FALSE),\"\")","v":""},null,null,null,null,null,null,{"$f":"IFERROR(VLOOKUP(C17,Tuoteluettelo!1:1048576,3,FALSE),\"\")","v":""},0,{"$f":"IFERROR(H17*I17,\"0\")","v":"0"},0,0]
[null,{"$f":"IFERROR(VLOOKUP(C18,Tuoteluettelo!1:1048576,2,FALSE),\"\")","v":""},null,null,null,null,null,null,{"$f":"IFERROR(VLOOKUP(C18,Tuoteluettelo!1:1048576,3,FALSE),\"\")","v":""},0,"0",0,0]
[null,{"$f":"IFERROR(VLOOKUP(C19,Tuoteluettelo!1:1048576,2,FALSE),\"\")","v":""},null,null,null,null,null,null,{"$f":"IFERROR(VLOOKUP(C19,Tuoteluettelo!1:1048576,3,FALSE),\"\")","v":""},0,"0",0,0]
[null,{"$f":"IFERROR(VLOOKUP(C20,Tuoteluettelo!1:1048576,2,FALSE),\"\")","v":""},null,null,null,null,null,null,{"$f":"IFERROR(VLOOKUP(C20,Tuoteluettelo!1:1048576,3,FALSE),\"\")","v":""},0,"0",0,0]
[null,{"$f":"IFERROR(VLOOKUP(C21,Tuoteluettelo!1:1048576,2,FALSE),\"\")","v":""},null,null,null,null,null,null,{"$f":"IFERROR(VLOOKUP(C21,Tuoteluettelo!1:1048576,3,FALSE),\"\")","v":""},0,"0",0,0]
[null,{"$f":"IFERROR(VLOOKUP(C22,Tuoteluettelo!1:1048576,2,FALSE),\"\")","v":""},null,null,null,null,null,null,{"$f":"IFERROR(VLOOKUP(C22,Tuoteluettelo!1:1048576,3,FALSE),\"\")","v":""},0,"0",0,0]
[null,{"$f":"IFERROR(VLOOKUP(C23,Tuoteluettelo!1:1048576,2,FALSE),\"\")","v":""},null,null,null,null,null,null,{"$f":"IFERROR(VLOOKUP(C23,Tuoteluettelo!1:1048576,3,FALSE),\"\")","v":""},0,"0",0,0]
[null,{"$f":"IFERROR(VLOOKUP(C24,Tuoteluettelo!1:1048576,2,FALSE),\"\")","v":""},null,null,null,null,null,null,{"$f":"IFERROR(VLOOKUP(C24,Tuoteluettelo!1:1048576,3,FALSE),\"\")","v":""},0,"0",0,0]
[null,{"$f":"IFERROR(VLOOKUP(C25,Tuoteluettelo!1:1048576,2,FALSE),\"\")","v":""},null,null,null,null,null,null,{"$f":"IFERROR(VLOOKUP(C25,Tuoteluettelo!1:1048576,3,FALSE),\"\")","v":""},0,"0",0,0]
[null,{"$f":"IFERROR(VLOOKUP(C26,Tuoteluettelo!1:1048576,2,FALSE),\"\")","v":""},null,null,null,null,null,null,{"$f":"IFERROR(VLOOKUP(C26,Tuoteluettelo!1:1048576,3,FALSE),\"\")","v":""},0,"0",0,0]
[null,null,null,null,null,null,null,null,null,"Veroton",null,null,{"$f":"K15+K16+K17+K18+K19+K20+K21+K22+K23+K24+K25+K26","v":0}]
[null,"Jos sinulla on tätä laskua koskevia kysymyksiä ota yhteyttä:",null,null,null,null,null,null,null,"Vero",null,null,{"$f":"L15+L16+L17+L18+L19+L20+L21+L22+L23+L24+L25+L26","v":0}]
[null,null,null,null,null,null,null,null,null,"Maksettava yhteensä",null,null,{"$f":"M15+M16+M17+M18+M19+M20+M21+M22+M23+M24+M25+M26","v":0}]
[null,"Anssi Ahkera","050-123 4567",null,"anssinauto@yritys.com"]
[]
[null,"Kiitos palveluidemme käyttämisestä."]

{"sheet":"Laskupohja pysty","index":2,"n_rows":40,"n_cols":35,"rows_kept":40,"cut":false,"hidden":false,"merged":[[5,2,5,8],[5,9,5,11],[6,3,6,8],[6,9,6,11],[1,2,3,8],[4,2,4,8],[4,9,4,11],[10,9,10,11],[13,3,13,8],[11,9,11,11],[11,2,11,8],[7,3,7,8],[7,9,7,11],[8,9,8,11],[8,2,8,3],[8,4,8,8],[23,3,23,7],[14,2,14,8],[15,2,15,3],[15,4,15,8],[12,2,12,8],[18,3,18,7],[19,3,19,7],[20,3,20,7],[21,3,21,7],[22,3,22,7],[39,2,39,12],[10,2,10,8],[9,10,9,11],[35,2,35,9],[36,5,36,8],[36,9,36,12],[13,9,13,11],[14,9,14,12],[30,10,30,11],[31,10,31,11],[24,3,24,7],[25,3,25,7],[26,3,26,7],[27,3,27,7],[28,3,28,7],[29,3,29,7]]}
[]
[null,null,"YRITYKSEN LOGO",null,null,null,null,null,null,"LASKU "]
[]
[null,null,null,null,null,null,null,null,null,"Päivämäärä",null,null,"Laskunro"]
[null,null,"NIMI",null,null,null,null,null,null,"00.00.0000",null,null,0]
[null,null,"KATUOSOITE",null,null,null,null,null,null,"Viitenumero",null,null,"Asiakasnro"]
[null,null,"POSTINRO ","POSTITOIMIPAIKKA",null,null,null,null,null,"00000 00000 00000",null,null,0]
[null,null,"PUHNRO","SÄHKÖPOSTI",null,null,null,null,null,"Huomautusaika",null,null,"Viivästyskorko"]
[null,null,"Y-tunnus",null,null,null,null,null,null,"vrk",null,null,"%"]
[null,null,null,null,null,null,null,null,null,"Maksuehdot","vrk",null,"Eräpäivä"]
[null,null,"Laskutettavan yhteystiedot",null,null,null,null,null,null,"Toimituspäivä",null,null,"00.00.0000",null,null,null," "]
[null,null,"LASKUN SAAJAN NIMI",null,null,null,null,null,null,"00.00.0000",null,null,"Tilausnumero"]
[null,null,"KATUOSOITE",null,null,null,null,null,null,null,null,null,0]
[null,null,"POSTINRO","POSTITOIMIPAIKKA",null,null,null,null,null,"Maksun saajan tilinumero"]
[null,null,"SÄHKÖPOSTI"]
[null,null,"Y-tunnus"]
[]
[null,null,"Tuotenumero","Tuotenimi",null,null,null,null,"määrä","á-hinta","Alv ","Veroton","Vero"]
[null,null,{"$f":"IFERROR(VLOOKUP(D19,Tuoteluettelo!1:1048576,2,FALSE),\"\")","v":""},null,null,null,null,null,null,{"$f":"IFERROR(VLOOKUP(D19,Tuoteluettelo!1:1048576,3,FALSE),\"\")","v":""},0.14000000000000001,{"$f":"IFERROR(I19*J19,\"0\")","v":"0"},{"$f":"IFERROR(K19*L19, \"0\")","v":0}]
[null,null,{"$f":"IFERROR(VLOOKUP(D20,Tuoteluettelo!1:1048576,2,FALSE),\"\")","v":""},null,null,null,null,null,null,{"$f":"IFERROR(VLOOKUP(D20,Tuoteluettelo!1:1048576,3,FALSE),\"\")","v":""},0,{"$f":"IFERROR(I20*J20,\"0\")","v":"0"},{"$f":"IFERROR(K20*L20, \"0\")","v":0}]
[null,null,{"$f":"IFERROR(VLOOKUP(D21,Tuoteluettelo!1:1048576,2,FALSE),\"\")","v":""},null,null,null,null,null,null,{"$f":"IFERROR(VLOOKUP(D21,Tuoteluettelo!1:1048576,3,FALSE),\"\")","v":""},0,{"$f":"IFERROR(I21*J21,\"0\")","v":"0"},0,null,null,null,null,null,null,null,null,null,null,null,null,null,null,null,null,null,null,null,null,null,"."]
[null,null,{"$f":"IFERROR(VLOOKUP(D22,Tuoteluettelo!1:1048576,2,FALSE),\"\")","v":""},null,null,null,null,null,null,{"$f":"IFERROR(VLOOKUP(D22,Tuoteluettelo!1:1048576,3,FALSE),\"\")","v":""},0,"0",0]
[null,null,{"$f":"IFERROR(VLOOKUP(D23,Tuoteluettelo!1:1048576,2,FALSE),\"\")","v":""},null,null,null,null,null,null,{"$f":"IFERROR(VLOOKUP(D23,Tuoteluettelo!1:1048576,3,FALSE),\"\")","v":""},0,"0",0]
[null,null,{"$f":"IFERROR(VLOOKUP(D24,Tuoteluettelo!1:1048576,2,FALSE),\"\")","v":""},null,null,null,null,null,null,{"$f":"IFERROR(VLOOKUP(D24,Tuoteluettelo!1:1048576,3,FALSE),\"\")","v":""},0,"0",0]
[null,null,{"$f":"IFERROR(VLOOKUP(D25,Tuoteluettelo!1:1048576,2,FALSE),\"\")","v":""},null,null,null,null,null,null,{"$f":"IFERROR(VLOOKUP(D25,Tuoteluettelo!1:1048576,3,FALSE),\"\")","v":""},0,"0",0]
[null,null,{"$f":"IFERROR(VLOOKUP(D26,Tuoteluettelo!1:1048576,2,FALSE),\"\")","v":""},null,null,null,null,null,null,{"$f":"IFERROR(VLOOKUP(D26,Tuoteluettelo!1:1048576,3,FALSE),\"\")","v":""},0,"0",0]
[null,null,{"$f":"IFERROR(VLOOKUP(D27,Tuoteluettelo!1:1048576,2,FALSE),\"\")","v":""},null,null,null,null,null,null,{"$f":"IFERROR(VLOOKUP(D27,Tuoteluettelo!1:1048576,3,FALSE),\"\")","v":""},0,"0",0]
[null,null,{"$f":"IFERROR(VLOOKUP(D28,Tuoteluettelo!1:1048576,2,FALSE),\"\")","v":""},null,null,null,null,null,null,{"$f":"IFERROR(VLOOKUP(D28,Tuoteluettelo!1:1048576,3,FALSE),\"\")","v":""},0,"0",0]
[null,null,{"$f":"IFERROR(VLOOKUP(D29,Tuoteluettelo!1:1048576,2,FALSE),\"\")","v":""},null,null,null,null,null,null,{"$f":"IFERROR(VLOOKUP(D29,Tuoteluettelo!1:1048576,3,FALSE),\"\")","v":""},0,"0",0]
[null,null,{"$f":"IFERROR(VLOOKUP(D30,Tuoteluettelo!1:1048576,2,FALSE),\"\")","v":""},null,null,null,null,null,null,{"$f":"IFERROR(VLOOKUP(D30,Tuoteluettelo!1:1048576,3,FALSE),\"\")","v":""},0,"0",0]
[null,null,null,null,null,null,null,null,null,null,"Veroton",null,{"$f":"+L19+L20+L21+L22+L23+L24+L25+L26+L27+L28+L29+L30","v":0}]
[null,null,null,null,null,null,null,null,null,null,"Vero",null,{"$f":"M19+M20+M21+M22+M23+M24+M25+M26+M27+M28+M29+M30","v":0}]
[null,null,null,null,null,null,null,null,null,null,"Maksettava yhteensä",null,{"$f":"+M31+M32","v":0}]
[]
[]
[null,null,"Jos sinulla on tätä laskua koskevia kysymyksiä ota yhteyttä:"]
[null,null,"Nimi",null,null,"Puhelinnumero",null,null,null,"Sähköpostiosoite"]
[]
[]
[null,null,"Kiitos palveluidemme käyttämisestä."]

{"sheet":"Tuoteluettelo","index":3,"n_rows":300,"n_cols":10,"rows_kept":300,"cut":false,"hidden":false,"merged":[]}
[]
["tuotenimi","tuotenumero","hinta",null,"ALV-kannat"]
[null,null,null,null,0]
[null,null,null,null,0.1]
[null,null,null,null,0.14000000000000001]
[null,null,null,null,0.24]
[]
[]
[]
[]
[]
[]
[]
[]
[]
[]
[]
[]
[]
[]
[]
[]
[]
[]
[]
[]
[]
[]
[]
[]
[]
[]
[]
[]
[]
[]
[]
[]
[]
[]
[]
[]
[]
[]
[]
[]
[]
[]
[]
[]
[]
[]
[]
[]
[]
[]
[]
[]
[]
[]
[]
[]
[]
[]
[]
[]
[]
[]
[]
[]
[]
[]
[]
[]
[]
[]
[]
[]
[]
[]
[]
[]
[]
[]
[]
[]
[]
[]
[]
[]
[]
[]
[]
[]
[]
[]
[]
[]
[]
[null,null,null,null,null,null,null,null,{"$f":"IF(H100=1,COUNTIF($H$3:H100,1),\"\")","v":""},{"$f":"IFERROR(INDEX($A$3:$A$103,MATCH(ROWS($I$3:I100),$I$3:$I$100,0)),\"\")","v":""}]
[null,null,null,null,null,null,null,null,{"$f":"IF(H101=1,COUNTIF($H$3:H101,1),\"\")","v":""},{"$f":"IFERROR(INDEX($A$3:$A$103,MATCH(ROWS($I$3:I101),$I$3:$I$100,0)),\"\")","v":""}]
[null,null,null,null,null,null,null,null,{"$f":"IF(H102=1,COUNTIF($H$3:H102,1),\"\")","v":""},{"$f":"IFERROR(INDEX($A$3:$A$103,MATCH(ROWS($I$3:I102),$I$3:$I$100,0)),\"\")","v":""}]
[null,null,null,null,null,null,null,null,{"$f":"IF(H103=1,COUNTIF($H$3:H103,1),\"\")","v":""},{"$f":"IFERROR(INDEX($A$3:$A$103,MATCH(ROWS($I$3:I103),$I$3:$I$100,0)),\"\")","v":""}]
[null,null,null,null,null,null,null,null,{"$f":"IF(H104=1,COUNTIF($H$3:H104,1),\"\")","v":""},{"$f":"IFERROR(INDEX($A$3:$A$103,MATCH(ROWS($I$3:I104),$I$3:$I$100,0)),\"\")","v":""}]
[null,null,null,null,null,null,null,null,{"$f":"IF(H105=1,COUNTIF($H$3:H105,1),\"\")","v":""},{"$f":"IFERROR(INDEX($A$3:$A$103,MATCH(ROWS($I$3:I105),$I$3:$I$100,0)),\"\")","v":""}]
[null,null,null,null,null,null,null,null,{"$f":"IF(H106=1,COUNTIF($H$3:H106,1),\"\")","v":""},{"$f":"IFERROR(INDEX($A$3:$A$103,MATCH(ROWS($I$3:I106),$I$3:$I$100,0)),\"\")","v":""}]
[null,null,null,null,null,null,null,null,{"$f":"IF(H107=1,COUNTIF($H$3:H107,1),\"\")","v":""},{"$f":"IFERROR(INDEX($A$3:$A$103,MATCH(ROWS($I$3:I107),$I$3:$I$100,0)),\"\")","v":""}]
[null,null,null,null,null,null,null,null,{"$f":"IF(H108=1,COUNTIF($H$3:H108,1),\"\")","v":""},{"$f":"IFERROR(INDEX($A$3:$A$103,MATCH(ROWS($I$3:I108),$I$3:$I$100,0)),\"\")","v":""}]
[null,null,null,null,null,null,null,null,{"$f":"IF(H109=1,COUNTIF($H$3:H109,1),\"\")","v":""},{"$f":"IFERROR(INDEX($A$3:$A$103,MATCH(ROWS($I$3:I109),$I$3:$I$100,0)),\"\")","v":""}]
[null,null,null,null,null,null,null,null,{"$f":"IF(H110=1,COUNTIF($H$3:H110,1),\"\")","v":""},{"$f":"IFERROR(INDEX($A$3:$A$103,MATCH(ROWS($I$3:I110),$I$3:$I$100,0)),\"\")","v":""}]
[null,null,null,null,null,null,null,null,{"$f":"IF(H111=1,COUNTIF($H$3:H111,1),\"\")","v":""},{"$f":"IFERROR(INDEX($A$3:$A$103,MATCH(ROWS($I$3:I111),$I$3:$I$100,0)),\"\")","v":""}]
[null,null,null,null,null,null,null,null,{"$f":"IF(H112=1,COUNTIF($H$3:H112,1),\"\")","v":""},{"$f":"IFERROR(INDEX($A$3:$A$103,MATCH(ROWS($I$3:I112),$I$3:$I$100,0)),\"\")","v":""}]
[null,null,null,null,null,null,null,null,{"$f":"IF(H113=1,COUNTIF($H$3:H113,1),\"\")","v":""},{"$f":"IFERROR(INDEX($A$3:$A$103,MATCH(ROWS($I$3:I113),$I$3:$I$100,0)),\"\")","v":""}]
[null,null,null,null,null,null,null,null,{"$f":"IF(H114=1,COUNTIF($H$3:H114,1),\"\")","v":""},{"$f":"IFERROR(INDEX($A$3:$A$103,MATCH(ROWS($I$3:I114),$I$3:$I$100,0)),\"\")","v":""}]
[null,null,null,null,null,null,null,null,{"$f":"IF(H115=1,COUNTIF($H$3:H115,1),\"\")","v":""},{"$f":"IFERROR(INDEX($A$3:$A$103,MATCH(ROWS($I$3:I115),$I$3:$I$100,0)),\"\")","v":""}]
[null,null,null,null,null,null,null,null,{"$f":"IF(H116=1,COUNTIF($H$3:H116,1),\"\")","v":""},{"$f":"IFERROR(INDEX($A$3:$A$103,MATCH(ROWS($I$3:I116),$I$3:$I$100,0)),\"\")","v":""}]
[null,null,null,null,null,null,null,null,{"$f":"IF(H117=1,COUNTIF($H$3:H117,1),\"\")","v":""},{"$f":"IFERROR(INDEX($A$3:$A$103,MATCH(ROWS($I$3:I117),$I$3:$I$100,0)),\"\")","v":""}]
[null,null,null,null,null,null,null,null,{"$f":"IF(H118=1,COUNTIF($H$3:H118,1),\"\")","v":""},{"$f":"IFERROR(INDEX($A$3:$A$103,MATCH(ROWS($I$3:I118),$I$3:$I$100,0)),\"\")","v":""}]
[null,null,null,null,null,null,null,null,{"$f":"IF(H119=1,COUNTIF($H$3:H119,1),\"\")","v":""},{"$f":"IFERROR(INDEX($A$3:$A$103,MATCH(ROWS($I$3:I119),$I$3:$I$100,0)),\"\")","v":""}]
[null,null,null,null,null,null,null,null,{"$f":"IF(H120=1,COUNTIF($H$3:H120,1),\"\")","v":""},{"$f":"IFERROR(INDEX($A$3:$A$103,MATCH(ROWS($I$3:I120),$I$3:$I$100,0)),\"\")","v":""}]
{"$rows_left_out":181}
{"sheet":"Ohje","index":4,"n_rows":47,"n_cols":3,"rows_kept":47,"cut":false,"hidden":false,"merged":[]}
["Ohjeet"]
["Ladatessasi laskupohjaa käyttöösi, tallenna se koneellesi. "]
["Laskupohja toimii näin varmemmin kuin selaimessa."]
["Alla olevien kysymysten kaltaisiin varoituksiin tulee vastata myöntävästi, jotta pohja toimii oikein."]
[]
[]
[]
[]
[]
[]
[]
[]
[]
[]
[]
[]
[]
["Tuoteluettelo"]
["Täytä tuoteluettelo-välilehdelle tiedot tuotteistasi oikeisiin sarakkeisiin niille varatuille paikoille "]
["(tällä hetkellä max. tuotemäärä voi olla 100):"]
[]
["Tuotenimi","Tuotehinta","á-hinta"]
[]
["Täyttäessäsi laskupohjaa:"]
[]
["1. Täytä oman yrityksesi tiedot laskupohjan yläosaan. "]
["Pohja kannattaa tallentaa omilla tiedoilla varustettuna, "]
["jolloin niitä ei tarvitse joka kerta erikseen lisätä."]
[]
["2. Täytä laskutustiedot: päivämäärä, laskun numero, viitenumero, asiakasnumero, "]
["viivästyskorko, eräpäivä jne. "]
[]
["3. Tässä vaiheessa laskupohja kannattaa tallentaa itselle, jolloin pysyvät tiedot ovat siinä valmiina."]
[]
["4. Täytä asiakkaan tiedot laskupohjaan."]
[]
["Laskun luominen:"]
["1. Kaksoisklikkaa tuotenimi -saraketta hiiren vasemmalla painikkeella. "]
["Kirjoita tuotenimi tai valitse se valikosta."]
["-> tuotenumero ja á hinta tulevat automaattisesti tuoteluettelosta."]
[]
["2. Lisää kappalemäärä sille kuuluvaan sarakkeeseen."]
[]
["2. Valitse käyttämäsi alv-prosentti sille varattuun sarakkeeseen valikosta napsauttamalla."]
[]
["Laskupohja laskee puolestasi verottoman ja verollisen hinnan, "]
["arvonlisäveron antamallasi prosentilla sekä yhteissumman."]